{"text_format":"1","workbook":"xlsx","n_sheets":13,"sheets":["Instructions","annual","monthly","variability","allocations","WSA-adjust","Q-data","EBF Calculation","lookup","WSC","thresholds","Output","Diversion Schedule"],"not_rendered":{"charts":0,"images":0,"macros":1,"external_links":0,"defined_names":3,"comments":0,"pivot_tables":0},"unopened":[],"bounds":{"document_bytes":16777216,"sheet_cells":100000,"rows_first":2000,"rows_last":500,"rows_between":2000,"halvings":0,"cell_chars":16384,"cell_head_chars":4096},"cells_cut":0,"cells_raw":0,"read":"whole","date_system":"1900"}

{"sheet":"Instructions","index":0,"n_rows":47,"n_cols":3,"rows_kept":47,"cut":false,"hidden":false,"merged":[[4,1,4,7],[3,1,3,12]]}
["The North-East Environmental Flow Needs (EFN) Tool (Interim) was developed as a component of the agreement between the Blueberry River First Nation (BRFN) and the Province of British Columbia."]
["It is intended to provide a transparent, quantitative Environmental Flow Needs (EFN) framework to support water withdrawals from rivers and streams while ensuring that BRFN's rights and interests are protected."]
["The NE EFN Tool (Interim) is built using the biological and ecological rationale, and the hydrologic processes and calculations developed by Alberta Environment and detailed in:"]
[null,"- A Desk-top Method for Establishing Environmental Flows in Alberta Rivers and Streams (Alberta Environment, 2010)"]
[null,"- Surface Water Allocation Directive (Alberta Environment, 2019)"]
[]
["The NE EFN Tool (Interim) uses information extracted from the North-East Water Tool (NEWT). For any Point of Diversion (POD) on a river or stream in north-east BC, the EFN Tool will:"]
[null,"-correct monthly discharge estimates to be as close to the observational record as possible"]
[null,"-determine an Ecosystem Base Flow (EBF) value for each month, as either the 5% or 20% low flow value based on daily flow frequency (large water sources, with MAD >10 m3/s, do not have an EBF)."]
[null,"-calculate the potential Maximum Water Allocation at the POD for each month, incoporating information of  currently authorized water allocation, and the discharge of the river at the time of diversion."]
{"$rows_left_out":38}
{"sheet":"annual","index":1,"n_rows":0,"n_cols":0,"rows_kept":0,"cut":false,"hidden":false,"merged":[]}

{"sheet":"monthly","index":2,"n_rows":0,"n_cols":0,"rows_kept":0,"cut":false,"hidden":false,"merged":[]}

{"sheet":"variability","index":3,"n_rows":0,"n_cols":0,"rows_kept":0,"cut":false,"hidden":false,"merged":[]}

{"sheet":"allocations","index":4,"n_rows":0,"n_cols":0,"rows_kept":0,"cut":false,"hidden":false,"merged":[]}

{"sheet":"WSA-adjust","index":5,"n_rows":21,"n_cols":4,"rows_kept":21,"cut":false,"hidden":false,"merged":[[7,1,8,1],[7,0,8,0],[7,3,7,10]]}
["This worksheet allows adjustments to be made to the NEWT-derived WSA authorizations. Adjustments made here are incorporated into the \"Output\" and \"Diversion Schedule\" worksheets."]
[]
[" This allows adjustments to be made to the WSA authorization by a Water Officer, when the water officer understands the data from NEWT to be incorrect with respect to determining EFN."]
["This can be common in old water licences, and in licenses where NEWT is calculating from a m3/year value rather than from an authorized m3/s or m3/day value. "]
["In Table 1 Part B, the water officer can insert adjustment values for up to 10 specified licences or authorizations."]
[]
["Table 1. "]
["Month","Total Adjustment for POD (m3/s",null,"Adjustment to WSA authorizations made by Water Officer, by WSA licence or authorization #, (m3/s).                            Enter a positive number to increase the average monthly water allocation, or a negative number to decrease it."]
[]
["Jan",{"$f":"SUM(C10:L10)","v":0}]
{"$rows_left_out":12}
{"sheet":"Q-data","index":6,"n_rows":402,"n_cols":17,"rows_kept":402,"cut":false,"hidden":false,"merged":[]}
["Blueberry (07FC003)",null,null,null,null,null,null,null,null,null,null,"NEWT",null,null,null,"Ratio NEWT:Data"]
[null,"Mean","Median","40th %tile","30th %tile","25th %tile","20th %tile","10th %tile","5th %tile","Mean",0.5,0.25,0.1,"Mean","50th %","25th %","10th %"]
["Jan",8.9087976539589414E-2,7.8E-2,6.3600000000000018E-2,5.0999999999999997E-2,0.04,3.1E-2,0.01,3.0000000000000001E-3,0.32,0.29004364902991597,0.129756369302857,2.28981828181513E-2,{"$f":"J3/B3","v":3.5919549688929866},3.7185083208963587,{"$f":"L3/F3","v":3.2439092325714247},{"$f":"M3/H3","v":2.2898182818151298}]
["Feb",7.2860389610389348E-2,7.0000000000000007E-2,0.06,4.4999999999999998E-2,3.6999999999999998E-2,2.8000000000000001E-2,4.0000000000000001E-3,9.5000000000000282E-4,0.28999999999999998,0.28386415810459698,0.101380056465927,1.2165606775911299E-2,3.9802147854373833,4.0552022586370988,2.7400015261061355,3.041401693977825]
["Mar",0.19690087976539586,9.4E-2,0.08,6.4000000000000001E-2,5.0999999999999997E-2,3.5000000000000003E-2,1.2E-2,2E-3,0.5,0.159410115082773,7.8391237911583297E-2,1.22623165448287E-2,2.5393487352405013,1.6958522881146063,1.5370830963055548,1.0218597120690582]
["Apr",10.910703815869171,2.95,1.38,0.6,0.41949999999999998,0.28999999999999998,0.14499999999999999,8.2000000000000003E-2,3.05,0.64077112055615104,9.7397210324534994E-2,3.4012131079120503E-2,0.27954200310743471,0.21721054934106815,0.23217451805610251,0.23456642123531382]
["May",21.518993341404389,11.4,9.2060000000000031,7.08,6.03,4.8120000000000003,2.6120000000000005,1.8110000000000004,19.190000000000001,10.1445121754687,5.5552230804360301,2.59964151140055,0.89177033960398111,0.88986948907620167,0.92126419244378599,0.99526857251169576]
["Jun",13.401285714285688,4.67,3.54,2.73,2.2925,1.84,1.1000000000000001,0.71394999999999997,15.88,4.88038927662648,2.38941015052316,1.1162430416259099,1.1849609312539333,1.0450512369649851,1.0422726937941811,1.0147664014780999]
["Jul",8.4816177698270838,2.83,1.9940000000000009,1.38,1.18,0.92920000000000036,0.52320000000000011,0.25740000000000002,10.85,2.8870978546580899,1.19804740907581,0.52105242234067495,1.2792370859481919,1.0201759203738834,1.0152944144710254,0.99589530263890447]
["Aug",4.2330047761193965,0.74199999999999999,0.48920000000000002,0.32199999999999995,0.26500000000000001,0.21299999999999999,0.125,6.1700000000000005E-2,5.99,0.76232775406871101,0.264766520089395,0.124889867966696,1.4150704562850334,1.0273958949713087,0.99911894373356602,0.99911894373356802]
{"$rows_left_out":393}
{"sheet":"EBF Calculation","index":7,"n_rows":33,"n_cols":17,"rows_kept":33,"cut":false,"hidden":false,"merged":[[19,11,19,13]]}
[]
[null,"Discharge at Reference Gauge",null,null,{"$f":"Output!#REF!","v":{"$error":"#REF!"}},{"$f":"Output!F10","v":{"$error":"#N/A"}}]
[null,"80% Frequency",null,"70% Frequency",null,"60% Frequency",null,"50% Frequency",null,"40% Frequency",null,"30% Frequency",null,"20% Frequency",null,"5% Frequency"]
[null,"m3/s","L/S/km2","m3/s","L/S/km2","m3/s","L/S/km2","m3/s","L/S/km2","m3/s","L/S/km2","m3/s","L/S/km2","m3/s","L/S/km2","m3/s","L/S/km2"]
["Month","Candidate 1","Candidate 1","Candidate 1","Candidate 1","Candidate 1","Candidate 1","Candidate 1","Candidate 1","Candidate 1","Candidate 1","Candidate 1","Candidate 1","Candidate 1","Candidate 1","Candidate 1","Candidate 1"]
["Jan",{"$f":"VLOOKUP(Output!$G$9,lookup!$A$2:$Q$28,8,0)","v":{"$error":"#N/A"}},{"$f":"($B6*1000)/VLOOKUP(Output!$G$9,lookup!$A$2:$Q$28,4,0)","v":{"$error":"#N/A"}},{"$f":"VLOOKUP(Output!$G$9,lookup!$A$2:$Q$28,9,0)","v":{"$error":"#N/A"}},{"$f":"($D6*1000)/VLOOKUP(Output!$G$9,lookup!$A$2:$Q$28,4,0)","v":{"$error":"#N/A"}},{"$f":"VLOOKUP(Output!$G$9,lookup!$A$2:$Q$28,10,0)","v":{"$error":"#N/A"}},{"$f":"($F6*1000)/VLOOKUP(Output!$G$9,lookup!$A$2:$Q$28,4,0)","v":{"$error":"#N/A"}},{"$f":"VLOOKUP(Output!$G$9,lookup!$A$2:$Q$28,11,0)","v":{"$error":"#N/A"}},{"$f":"($H6*1000)/VLOOKUP(Output!$G$9,lookup!$A$2:$Q$28,4,0)","v":{"$error":"#N/A"}},{"$f":"VLOOKUP(Output!$G$9,lookup!$A$2:$Q$28,12,0)","v":{"$error":"#N/A"}},{"$f":"($J6*1000)/VLOOKUP(Output!$G$9,lookup!$A$2:$Q$28,4,0)","v":{"$error":"#N/A"}},{"$f":"VLOOKUP(Output!$G$9,lookup!$A$2:$Q$28,13,0)","v":{"$error":"#N/A"}},{"$f":"($L6*1000)/VLOOKUP(Output!$G$9,lookup!$A$2:$Q$28,4,0)","v":{"$error":"#N/A"}},{"$f":"VLOOKUP(Output!$G$9,lookup!$A$2:$Q$28,15,0)","v":{"$error":"#N/A"}},{"$f":"($N6*1000)/VLOOKUP(Output!$G$9,lookup!$A$2:$Q$28,4,0)","v":{"$error":"#N/A"}},{"$f":"VLOOKUP(Output!$G$9,lookup!$A$2:$Q$28,17,0)","v":{"$error":"#N/A"}},{"$f":"($P6*1000)/VLOOKUP(Output!$G$9,lookup!$A$2:$Q$28,4,0)","v":{"$error":"#N/A"}}]
["Feb",{"$f":"VLOOKUP(Output!$G$9,lookup!$A$29:$Q$55,8,0)","v":{"$error":"#N/A"}},{"$f":"($B7*1000)/VLOOKUP(Output!$G$9,lookup!$A$29:$Q$55,4,0)","v":{"$error":"#N/A"}},{"$f":"VLOOKUP(Output!$G$9,lookup!$A$29:$Q$55,9,0)","v":{"$error":"#N/A"}},{"$f":"($D7*1000)/VLOOKUP(Output!$G$9,lookup!$A$29:$Q$55,4,0)","v":{"$error":"#N/A"}},{"$f":"VLOOKUP(Output!$G$9,lookup!$A$29:$Q$55,10,0)","v":{"$error":"#N/A"}},{"$f":"($F7*1000)/VLOOKUP(Output!$G$9,lookup!$A$29:$Q$55,4,0)","v":{"$error":"#N/A"}},{"$f":"VLOOKUP(Output!$G$9,lookup!$A$29:$Q$55,11,0)","v":{"$error":"#N/A"}},{"$f":"($H7*1000)/VLOOKUP(Output!$G$9,lookup!$A$29:$Q$55,4,0)","v":{"$error":"#N/A"}},{"$f":"VLOOKUP(Output!$G$9,lookup!$A$29:$Q$55,12,0)","v":{"$error":"#N/A"}},{"$f":"($J7*1000)/VLOOKUP(Output!$G$9,lookup!$A$29:$Q$55,4,0)","v":{"$error":"#N/A"}},{"$f":"VLOOKUP(Output!$G$9,lookup!$A$29:$Q$55,13,0)","v":{"$error":"#N/A"}},{"$f":"($L7*1000)/VLOOKUP(Output!$G$9,lookup!$A$29:$Q$55,4,0)","v":{"$error":"#N/A"}},{"$f":"VLOOKUP(Output!$G$9,lookup!$A$29:$Q$55,15,0)","v":{"$error":"#N/A"}},{"$f":"($N7*1000)/VLOOKUP(Output!$G$9,lookup!$A$29:$Q$55,4,0)","v":{"$error":"#N/A"}},{"$f":"VLOOKUP(Output!$G$9,lookup!$A$29:$Q$55,17,0)","v":{"$error":"#N/A"}},{"$f":"($P7*1000)/VLOOKUP(Output!$G$9,lookup!$A$29:$Q$55,4,0)","v":{"$error":"#N/A"}}]
["Mar",{"$f":"VLOOKUP(Output!$G$9,lookup!$A$56:$Q$82,8,0)","v":{"$error":"#N/A"}},{"$f":"($B8*1000)/VLOOKUP(Output!$G$9,lookup!$A$56:$Q$82,4,0)","v":{"$error":"#N/A"}},{"$f":"VLOOKUP(Output!$G$9,lookup!$A$56:$Q$82,9,0)","v":{"$error":"#N/A"}},{"$f":"($D8*1000)/VLOOKUP(Output!$G$9,lookup!$A$56:$Q$82,4,0)","v":{"$error":"#N/A"}},{"$f":"VLOOKUP(Output!$G$9,lookup!$A$56:$Q$82,10,0)","v":{"$error":"#N/A"}},{"$f":"($F8*1000)/VLOOKUP(Output!$G$9,lookup!$A$56:$Q$82,4,0)","v":{"$error":"#N/A"}},{"$f":"VLOOKUP(Output!$G$9,lookup!$A$56:$Q$82,11,0)","v":{"$error":"#N/A"}},{"$f":"($H8*1000)/VLOOKUP(Output!$G$9,lookup!$A$56:$Q$82,4,0)","v":{"$error":"#N/A"}},{"$f":"VLOOKUP(Output!$G$9,lookup!$A$56:$Q$82,12,0)","v":{"$error":"#N/A"}},{"$f":"($J8*1000)/VLOOKUP(Output!$G$9,lookup!$A$56:$Q$82,4,0)","v":{"$error":"#N/A"}},{"$f":"VLOOKUP(Output!$G$9,lookup!$A$56:$Q$82,13,0)","v":{"$error":"#N/A"}},{"$f":"($L8*1000)/VLOOKUP(Output!$G$9,lookup!$A$56:$Q$82,4,0)","v":{"$error":"#N/A"}},{"$f":"VLOOKUP(Output!$G$9,lookup!$A$56:$Q$82,15,0)","v":{"$error":"#N/A"}},{"$f":"($N8*1000)/VLOOKUP(Output!$G$9,lookup!$A$56:$Q$82,4,0)","v":{"$error":"#N/A"}},{"$f":"VLOOKUP(Output!$G$9,lookup!$A$56:$Q$82,17,0)","v":{"$error":"#N/A"}},{"$f":"($P8*1000)/VLOOKUP(Output!$G$9,lookup!$A$56:$Q$82,4,0)","v":{"$error":"#N/A"}}]
["Apr",{"$f":"VLOOKUP(Output!$G$9,lookup!$A$83:$Q$109,8,0)","v":{"$error":"#N/A"}},{"$f":"($B9*1000)/VLOOKUP(Output!$G$9,lookup!$A$83:$Q$109,4,0)","v":{"$error":"#N/A"}},{"$f":"VLOOKUP(Output!$G$9,lookup!$A$83:$Q$109,9,0)","v":{"$error":"#N/A"}},{"$f":"($D9*1000)/VLOOKUP(Output!$G$9,lookup!$A$83:$Q$109,4,0)","v":{"$error":"#N/A"}},{"$f":"VLOOKUP(Output!$G$9,lookup!$A$83:$Q$109,10,0)","v":{"$error":"#N/A"}},{"$f":"($F9*1000)/VLOOKUP(Output!$G$9,lookup!$A$83:$Q$109,4,0)","v":{"$error":"#N/A"}},{"$f":"VLOOKUP(Output!$G$9,lookup!$A$83:$Q$109,11,0)","v":{"$error":"#N/A"}},{"$f":"($H9*1000)/VLOOKUP(Output!$G$9,lookup!$A$83:$Q$109,4,0)","v":{"$error":"#N/A"}},{"$f":"VLOOKUP(Output!$G$9,lookup!$A$83:$Q$109,12,0)","v":{"$error":"#N/A"}},{"$f":"($J9*1000)/VLOOKUP(Output!$G$9,lookup!$A$83:$Q$109,4,0)","v":{"$error":"#N/A"}},{"$f":"VLOOKUP(Output!$G$9,lookup!$A$83:$Q$109,13,0)","v":{"$error":"#N/A"}},{"$f":"($L9*1000)/VLOOKUP(Output!$G$9,lookup!$A$83:$Q$109,4,0)","v":{"$error":"#N/A"}},{"$f":"VLOOKUP(Output!$G$9,lookup!$A$83:$Q$109,15,0)","v":{"$error":"#N/A"}},{"$f":"($N9*1000)/VLOOKUP(Output!$G$9,lookup!$A$83:$Q$109,4,0)","v":{"$error":"#N/A"}},{"$f":"VLOOKUP(Output!$G$9,lookup!$A$83:$Q$109,17,0)","v":{"$error":"#N/A"}},{"$f":"($P9*1000)/VLOOKUP(Output!$G$9,lookup!$A$83:$Q$109,4,0)","v":{"$error":"#N/A"}}]
["May",{"$f":"VLOOKUP(Output!$G$9,lookup!$A$110:$Q$136,8,0)","v":{"$error":"#N/A"}},{"$f":"($B10*1000)/VLOOKUP(Output!$G$9,lookup!$A$110:$Q$136,4,0)","v":{"$error":"#N/A"}},{"$f":"VLOOKUP(Output!$G$9,lookup!$A$110:$Q$136,9,0)","v":{"$error":"#N/A"}},{"$f":"($D10*1000)/VLOOKUP(Output!$G$9,lookup!$A$110:$Q$136,4,0)","v":{"$error":"#N/A"}},{"$f":"VLOOKUP(Output!$G$9,lookup!$A$110:$Q$136,10,0)","v":{"$error":"#N/A"}},{"$f":"($F10*1000)/VLOOKUP(Output!$G$9,lookup!$A$110:$Q$136,4,0)","v":{"$error":"#N/A"}},{"$f":"VLOOKUP(Output!$G$9,lookup!$A$110:$Q$136,11,0)","v":{"$error":"#N/A"}},{"$f":"($H10*1000)/VLOOKUP(Output!$G$9,lookup!$A$110:$Q$136,4,0)","v":{"$error":"#N/A"}},{"$f":"VLOOKUP(Output!$G$9,lookup!$A$110:$Q$136,12,0)","v":{"$error":"#N/A"}},{"$f":"($J10*1000)/VLOOKUP(Output!$G$9,lookup!$A$110:$Q$136,4,0)","v":{"$error":"#N/A"}},{"$f":"VLOOKUP(Output!$G$9,lookup!$A$110:$Q$136,13,0)","v":{"$error":"#N/A"}},{"$f":"($L10*1000)/VLOOKUP(Output!$G$9,lookup!$A$110:$Q$136,4,0)","v":{"$error":"#N/A"}},{"$f":"VLOOKUP(Output!$G$9,lookup!$A$110:$Q$136,15,0)","v":{"$error":"#N/A"}},{"$f":"($N10*1000)/VLOOKUP(Output!$G$9,lookup!$A$110:$Q$136,4,0)","v":{"$error":"#N/A"}},{"$f":"VLOOKUP(Output!$G$9,lookup!$A$110:$Q$136,17,0)","v":{"$error":"#N/A"}},{"$f":"($P10*1000)/VLOOKUP(Output!$G$9,lookup!$A$110:$Q$136,4,0)","v":{"$error":"#N/A"}}]
{"$rows_left_out":24}
{"sheet":"lookup","index":8,"n_rows":325,"n_cols":17,"rows_kept":325,"cut":false,"hidden":false,"merged":[]}
["WSC","Month","Name","Drainage Area (km2)","NEWT Mean (m3/s)","Adjustment NEWT:WSC","Mean","80th %tile","70th %tile","60th %tile","Median","40th %tile","30th %tile","25th %tile","20th %tile","10th %tile","5th %tile"]
["07FA001","Jan","Halfway (FA001)",9400,13,{"$f":"G2/E2","v":0.95115012406947941},12.364951612903232,15.820000000000006,14.4,13.7,12.45,10.5,9.6300000000000008,9.3624999999999989,8.7739999999999991,7.08,6.5495000000000001]
["07FA003","Jan","Halfway ",3764,6.76,0.91900843389677034,6.2124970131421673,7.22,6.76,6.2319999999999993,5.75,5.21,4.9000000000000004,4.7300000000000004,4.4000000000000004,3.8860000000000001,3.46]
["07FA005","Jan","Graham ",2142,5.35,0.98720943147739726,5.281570458404075,6.15,5.859,5.46,5.21,4.88,4.5999999999999996,4.4024999999999999,4.3,4.04,3.7885]
["07FA006","Jan","Halfway (FA006)",9340,13,0.94597210113339303,12.297637314734109,15.3,14.2,13,12,11.2,10.6,10.199999999999999,9.68,8.5,7.74]
["07FB001","Jan","Pine",12147,41.66,0.89891446035147837,37.448776418242588,47.02,42.2,39,35.4,33.200000000000003,30.2,29.2,27.9,24.3,21.5]
["07FB003","Jan","Sukunka",2590,12.19,0.81891375316049253,9.9825586510264035,12.6,11.1,10.199999999999999,9.0350000000000001,8.2060000000000013,7.61,7.42,7.23,6.4,5.6975000000000007]
["07FB004","Jan","Dickebusch",82.4,0.08,0.58551136363636302,4.6840909090909044E-2,8.5999999999999993E-2,5.8999999999999997E-2,4.4799999999999951E-2,3.4000000000000002E-2,2.1999999999999999E-2,1.4E-2,0.01,7.0000000000000001E-3,3.0000000000000001E-3,1E-3]
["07FB005","Jan","Quality",29.5,0.02,1.2074333800841532,2.4148667601683063E-2,4.2000000000000003E-2,3.4000000000000002E-2,2.8399999999999977E-2,1.7999999999999999E-2,1.4999999999999999E-2,1.2E-2,9.2499999999999995E-3,7.0000000000000001E-3,2E-3,1E-3]
["07FB008","Jan","Moberly",1520,2.02,0.96385264102447121,1.946982334869432,2.6320000000000006,2.15,1.99,1.85,1.6260000000000001,1.39,1.31,1.1200000000000001,0.65270000000000006,0.50775000000000003]
{"$rows_left_out":316}
{"sheet":"WSC","index":9,"n_rows":29,"n_cols":8,"rows_kept":29,"cut":false,"hidden":false,"merged":[]}
["WSC Gauge","Name_short","Name","Area (km2)","Type","Record",null,"Gauges (realtime) for dropdown list"]
["07FA001","Halfway (Farrell), Lower","Halfway River near Farrell Creek (Lower)",9400,"discontinued","1961-1983",null,"07FA003"]
["07FA003","Halfway (Graham)","Halfway River above Graham River",3764,"real-time","1977-2021",null,"07FA005"]
["07FA005","Graham","Graham River above Colt Creek",2142,"real-time","1981-2021",null,"07FA006"]
["07FA006","Halfway (Farrell)","Halfway River above Farrell Creek",9340,"real-time","1984-2021",null,"07FB001"]
["07FB001","Pine","Pine River at East Pine",12147,"real-time","1962-2021",null,"07FB003"]
["07FB003","Sukunka","Sukunka R near the mouth",2590,"real-time","1977-2021",null,"07FB004"]
["07FB004","Dickebusch","Dickebusch Cr near the mouth",82.4,"real-time","1978-2021",null,"07FB008"]
["07FB005","Quality","Quality Cr neear the mouth",29.5,"discontinued","1978-2001",null,"07FB009"]
["07FB008","Moberly","Moberly River near Fort St John",1520,"real-time","1980-2021",null,"07FC001"]
{"$rows_left_out":20}
{"sheet":"thresholds","index":10,"n_rows":6,"n_cols":5,"rows_kept":6,"cut":false,"hidden":false,"merged":[[0,2,1,4],[0,1,1,1],[0,0,2,0]]}
["Watershed Size Class","Mean Annual Discharge (MAD)"," Maximum Cumulative Withdrawal, % of Natural or Naturalized Weekly or Monthly Flow"]
[]
[null,"m3/s",">Q80","≤Q80 - >Q95","≤Q95"]
[3,"≥10",0.15,0.05,0.05]
[2,"≥2 - ≤10 ",0.15,0.05,0]
[1,"<2",0.1,0,0]

{"sheet":"Output","index":11,"n_rows":28,"n_cols":37,"rows_kept":28,"cut":false,"hidden":false,"merged":[[10,33,11,34],[10,35,11,36],[10,9,11,32],[9,5,10,7],[8,0,8,3],[9,0,9,3],[12,18,12,20],[12,30,12,32],[12,9,12,11],[12,12,12,14],[12,15,12,17],[12,33,12,34],[12,35,12,36],[12,27,12,29],[12,24,12,26],[12,21,12,23],[4,0,4,1],[0,6,1,7],[0,2,0,3],[2,0,2,1],[3,0,3,1],[2,2,2,3],[5,0,5,1],[12,2,12,3],[12,4,12,5],[12,6,12,7],[10,0,10,3],[7,0,7,4],[7,5,8,5]]}
["Location (USER):",null,null,null,"Date: ",{"$f":"TODAY()","v":"2023-03-22"},"Enter WSA Application Amount:"]
["Location (NEWT):",null,{"$f":"annual!$A$1","v":0}]
["Coordinates:",null,null,null,null,null,"m3/s, or"]
["Wastershed Area (km2):",null,{"$f":"annual!$A3","v":0},null,null,null,"m3/day, or"]
["Mean Annual Discharge (MAD) (m3/s):",null,{"$f":"annual!B3","v":0},null,null,null,"m3/year"]
["Watershed Size Class:",null,{"$f":"IF($C5<2,1,IF($C5>=10,3,2))","v":1},{"$f":"IF($C5<2,\"MAD < 2.0 m3/s\",IF($C5>=10,\"MAD >= 10.0 m3/s\",\"MAD >= 2.0 and < 10.0 m3/s\"))","v":"MAD < 2.0 m3/s"},null,null,"m3/s, used in further calculations",{"$f":"IF(H$3>0,H$3,IF(H$4>0,H$4/(60*60*24),IF(H$5>0,H$5/(365*60*60*24),0)))","v":0}]
[]
["Maximum Water Allocation (MWA) rates, based on EBF threshold",null,null,null,null,"WSC Reference Gauge:","Default","User Selected"]
["When discharge is > 20% Ecosystem Base Flow (EBF) threshold:",null,null,null,{"$f":"VLOOKUP($C$6,thresholds!$A$4:$E$6,3,0)","v":0.1},null,{"$f":"IF(H9=\"\",variability!J3,H9)","v":0}]
["When discharge is > 5% and ≤ 20% Ecosystem Base Flow (EBF) threshold:",null,null,null,{"$f":"VLOOKUP($C$6,thresholds!$A$4:$E$6,4,0)","v":0},{"$f":"VLOOKUP($G$9,WSC!$A$2:$F$27,3,0)","v":{"$error":"#N/A"}}]
{"$rows_left_out":19}
{"sheet":"Diversion Schedule","index":12,"n_rows":28,"n_cols":23,"rows_kept":28,"cut":false,"hidden":false,"merged":[[2,1,2,2],[3,1,3,2],[8,0,9,0],[14,2,14,3],[14,14,14,15],[3,3,3,4],[4,3,4,4],[6,3,6,5],[14,17,14,18],[14,20,14,21],[14,11,14,12],[14,5,14,6],[14,8,14,9]]}
["Schedule 1. Diversion Table"]
[]
["POD Location:",{"$f":"Output!C1","v":0},null,"Location (NEWT):",null,{"$f":"Output!C2","v":0}]
["POD Coordinates:",{"$f":"Output!C3","v":0},null,"Wastershed Area (km2):",null,{"$f":"Output!C4","v":0}]
["Authorization Holder:",null,null,"Mean Annual Discharge (MAD) (m3/s):",null,{"$f":"Output!C5","v":0}]
["Authorization Number:",null,null,"Reference Gauge:",null,{"$f":"Output!G9","v":0}]
["Date:",{"$f":"TODAY()","v":"2023-03-22"},null,{"$f":"Output!F10","v":{"$error":"#N/A"}}]
[]
["Maximum approved diversion rate:",{"$f":"Output!H6","v":0},"m3/s"]
[null,{"$f":"B9*(60*60*24)","v":0},"m3/day"]
{"$rows_left_out":18}